balance publique
created: 2014-05-27T17:36:58+02:00
modified: 2015-02-26T11:39:58+01:00
status: 1
type: Concept
alternative label: poids public
broad match: cb11983022j
broader: T96-1342
definition: Ouvrage permettant de vérifier la masse des matières vendues : sacs de contenance diverse, animaux, etc. Elle est souvent placée à proximité d'un marché ou d'un champ de foire.
in scheme: T96