aérodrome
terme associe: T1-1397
terme associe: T1-585
created: 2014-03-12T19:13:55+01:00
modified: 2012-11-22T00:00:00+01:00
status: 1
type: Concept
alternative label: aérogare
alternative label: aéroport
alternative label: héliport
alternative label: terrain d'aviation
broader: T1-548
in scheme: Matiere
related: T1-1397
related: T1-585
scope note: A utiliser pour tout terrain d'aviation, y compris aérodrome à usage privé.