propriété publique
terme associe: T1-1095
terme associe: T1-838
focus: http://dbpedia.org/resource/Public_property
created: 2014-03-12T19:13:55+01:00
modified: 2012-11-22T00:00:00+01:00
status: 1
type: Concept
broader: T1-1222
in scheme: Matiere
narrower: T1-1051
narrower: T1-1070
narrower: T1-1113
narrower: T1-1433
narrower: T1-333
narrower: T1-377
narrower: T1-383
narrower: T1-495
narrower: T1-616
narrower: T1-690
narrower: T1-763
narrower: T1-766
narrower: T1-93
related: T1-1095
related: T1-838
scope note: Concerne aussi le domaine privé de la personne publique.