vente au déballage
created: 2014-03-12T19:13:55+01:00
modified: 2012-11-22T00:00:00+01:00
status: 1
type: Concept
broader: T1-1248
in scheme: Matiere
narrower: T1-947
scope note: Le terme désigne toute forme de vente occasionnelle de marchandises neuves à prix réduit (promotion, liquidation, soldes) et qui est précédée ou accompagnée de publicité.