pêche à la ligne
terme associe: T1-130
terme associe: T1-425
terme associe: T1-735
created: 2014-03-12T19:13:55+01:00
modified: 2012-11-22T00:00:00+01:00
status: 1
type: Concept
broader: T1-1173
in scheme: Matiere
narrower: T1-340
narrower: T1-381
narrower: T1-876
related: T1-130
related: T1-425
related: T1-735
scope note: Ce descripteur devra être utilisé pour indexer les notions relatives à la pêche comme activité de loisir.