magasin collectif
terme associe: T1-478
created: 2014-03-12T19:13:55+01:00
modified: 2012-11-22T00:00:00+01:00
status: 1
type: Concept
alternative label: centre commercial
broader: T1-1158
in scheme: Matiere
related: T1-478
scope note: Les magasins collectifs de commerçants indépendants, régis par la loi n°72-651 du 11 juillet 1972, constituent la forme la plus usuelle des centres commerciaux.