droits d'usage
terme associe: T1-1324
terme associe: T1-252
created: 2014-03-12T19:13:55+01:00
modified: 2012-11-22T00:00:00+01:00
status: 1
type: Concept
alternative label: droit d'usage d'eau
alternative label: droit de chasse
alternative label: droit de coupe de bois
alternative label: droit de pacage
alternative label: droit de pêche
broader: T1-29
in scheme: Matiere
related: T1-1324
related: T1-252
scope note: Peut concerner aussi la période révolutionnaire et le XIXe siècle.