assemblée nationale
terme associe: T1-1254
terme associe: T1-1383
terme associe: T1-902
created: 2014-03-12T19:13:55+01:00
modified: 2012-11-22T00:00:00+01:00
status: 1
type: Concept
broader: T1-1157
in scheme: Matiere
related: T1-1254
related: T1-1383
related: T1-902
scope note: S'emploie pour toute assemblée délibérante de niveau national, quelle que soit la période.