armée
focus: http://dbpedia.org/resource/Armed_force
created: 2014-03-12T19:13:55+01:00
modified: 2012-11-22T00:00:00+01:00
status: 1
type: Concept
alternative label: affectation spéciale
alternative label: cadre de réserve
broader: T1-250
in scheme: Matiere
narrower: T1-122
narrower: T1-1352
narrower: T1-455
narrower: T1-977
scope note: Descripteur à utiliser pour indexer les déplacements et l'installation des corps de troupe.