magasin général
created: 2014-03-12T19:13:55+01:00
modified: 2012-11-22T00:00:00+01:00
status: 1
type: Concept
broader: T1-1248
in scheme: Matiere
scope note: Régis par l'ordonnance n° 45-1744 du 6 août 1945, les magasins généraux sont des entrepôts, souvent exploités par les chambres de commerce, où sont déposées des marchandises en garantie de prêt (warrantage).