marché d'intérêt national
created: 2014-03-12T19:13:55+01:00
modified: 2012-11-22T00:00:00+01:00
status: 1
type: Concept
broader: T1-785
in scheme: Matiere
scope note: Ne plus utiliser ce descripteur, transformé en non descripteur de "marché en gros", suite à l'appel à commentaires d'octobre 2010-mars 2011.