oeuvre restaurée
created: 2013-06-07T14:06:58+02:00
modified: 2015-03-06T17:45:29+01:00
status: 1
type: Concept
alternative label: œuvre restaurée
broader: T124-1
in scheme: T124
narrower: T124-85
narrower: T124-86
scope note: Uniquement si la restauration est importante. Préciser en PETA : consolidé, doublé, recollé, redoré, remonté, repeint, retouché, surdécoré, etc.