altération biologique de la matière
created: 2013-06-07T14:06:58+02:00
modified: 2013-06-07T00:00:00+02:00
status: 1
type: Concept
broader: T124-66
in scheme: T124
scope note: Préciser en PETA : présence d’insectes, de moisissures, de champignons ou d’algues.