oeuvre brûlée
created: 2013-06-07T14:06:58+02:00
modified: 2015-03-06T17:49:42+01:00
status: 1
type: Concept
alternative label: œuvre brûlée
broader: T124-1
in scheme: T124
scope note: Si l'altération est générale ou importante.