classement
created: 2013-07-05T10:06:02+0200
modified: 2011-04-08T00:00:00+0200
status: 1
type: Concept
in scheme: T2
scope note: S'emploie pour les installations classées, les bâtiments recevant du public, les hôtels et les campings... Ne s'emploie pas pour le patrimoine (voir PROTECTION).