construction
terme associe: T2-7
created: 2013-07-05T10:06:02+0200
modified: 2011-04-08T00:00:00+0200
status: 1
type: Concept
in scheme: T2
related: T2-7
scope note: Le terme s'emploie quand l'Etat, une collectivité territoriale ou un organisme public sont maîtres d'ouvrage (construction d'un bâtiment administratif ou de toute infrastructure publique).