organisation
created: 2013-07-05T10:06:02+0200
modified: 2011-04-08T00:00:00+0200
status: 1
type: Concept
alternative label: modernisation
alternative label: réforme administrative
in scheme: T2
scope note: Terme à associer avec le mot objet STRUCTURE ADMINISTRATIVE pour tout ce qui touche à l'évaluation, la modernisation et aux réformes des structures administratives.