toit à longs pans
terme associe: T26-30
created: 2013-07-10T11:50:46+02:00
modified: 2016-04-13T16:48:06+02:00
status: 1
type: Concept
broader: T26-11
definition: Toit de forme allongée à deux versants principaux.
in scheme: T26
narrower: T26-13
narrower: T26-14
related: T26-30