toit à longs pans brisés
created: 2013-07-10T11:50:46+02:00
modified: 2016-04-13T17:01:48+02:00
status: 1
type: Concept
broader: T26-12
definition: Toit présentant deux pentes différentes sur le même versant, séparées par une arête saillante, la ligne de brisis.
in scheme: T26