toit à égout retroussé
created: 2013-07-10T11:50:46+02:00
modified: 2016-06-01T15:10:47+02:00
status: 1
type: Concept
alternative label: toit à longs pans inversés
broader: T26-12
definition: Toit dont les versants sont brisés par une arête rentrante dans la partie basse, de manière que la pente de l'égout soit moins forte que la pente générale.
in scheme: T26