bulbe
created: 2013-07-10T11:50:46+02:00
modified: 2016-04-14T11:00:05+02:00
status: 1
type: Concept
broader: T26-20
definition: Toit de plan centré à versant continu ou à pans, galbé suivant une courbe alternativement concave ou convexe, les parties convexes formant des renflements qui surplombent les parties concaves : ces renflements distinguent le bulbe du toit à l'impériale dont le volume diminue progressivement suivant le galbe.
in scheme: T26
narrow match: Clocher à bulbe
preferred label: onion dome @en