dôme
created: 2013-07-10T11:50:46+02:00
modified: 2016-04-14T11:21:55+02:00
status: 1
type: Concept
broader: T26-20
definition: Toit de plan centré à versant continu ou à pans, galbé en quart de rond. Son plan est habituellement circulaire et son volume, une convexité de révolution.
in scheme: T26
narrower: T26-23
narrower: T26-24
narrower: T26-25
preferred label: dome @en