toit à l'impériale
created: 2013-07-10T11:50:46+02:00
modified: 2016-04-14T14:29:35+02:00
status: 1
type: Concept
broader: T26-20
definition: ​Toit de plan centré à versant continu ou à pans, galbé en doucine ou en talon renversé. Ne pas confondre le toit à l'impériale avec le bulbe.
in scheme: T26