flèche en maçonnerie
created: 2013-07-10T11:50:46+02:00
modified: 2016-04-13T12:56:45+02:00
status: 1
type: Concept
broader: T26-2
definition: Couverture de plan centré ayant un grand développement en hauteur : sa hauteur est supérieure à la largeur de sa base. Ce type de flèche est réalisé en maçonnerie et non en matériaux de couverture.
in scheme: T26