toit brisé en pavillon
created: 2013-07-10T11:50:46+02:00
modified: 2016-04-14T16:56:01+02:00
status: 1
type: Concept
broad match: http://data.bnf.fr/ark:/12148/cb167692841
broad match: http://vocab.getty.edu/aat/300002150
broader: T26-39
definition: Toit à quatre versants non galbés, présentant chacun deux pentes différentes séparées par une arête saillante et couvrant un corps de bâtiment carré ou sensiblement carré.
in scheme: T26