flèche rhomboïdale
created: 2013-07-10T11:50:46+02:00
modified: 2016-04-14T17:27:05+02:00
status: 1
type: Concept
broader: T26-41
definition: Couverture à versants en losange ayant un grand développement en hauteur et couvrant un bâtiment carré ou polygonal dont toutes les faces se terminent en pignons : chaque losange est dessiné par les rampants de deux pignons contigus et par le arêtes qui prennent naissance au sommet des pignons et s'achèvent en une pointe commune.
in scheme: T26