appentis massé
created: 2013-07-10T11:50:46+02:00
modified: 2016-04-14T14:38:38+02:00
status: 1
type: Concept
broader: T26-29
definition: Toit à un seul versant, de plan massé, dont le faîte s'appuie sur ou contre un mur.
in scheme: T26
narrower: T26-44