appentis massé brisé
created: 2013-07-10T11:50:46+02:00
modified: 2013-07-10T00:00:00+02:00
status: 1
type: Concept
broader: T26-43
definition: Toit présentant deux pentes différentes séparées par une arête saillante sur son seul versant et appuyé sur ou contre un mur.
in scheme: T26