croupe brisée
created: 2013-07-10T11:50:46+02:00
modified: 2016-04-15T14:05:31+02:00
status: 1
type: Concept
broad match: Croupe (architecture)
broader: T26-46
definition: Croupe dont le versant présente deux pentes différentes, séparées par une arête saillante.
in scheme: T26