terrasse
created: 2013-07-10T11:50:46+02:00
modified: 2016-06-02T10:52:50+02:00
status: 1
type: Concept
definition: Couverture horizontale d'un bâtiment. Ne pas confondre la terrasse de couverture et la terrasse en terre-plein. Ne pas confondre la terrasse étroite avec le balcon qui est en surplomb.
in scheme: T26