demi-croupe
created: 2013-07-10T11:50:46+02:00
modified: 2016-04-15T14:36:16+02:00
status: 1
type: Concept
definition: Croupe qui ne descend pas aussi bas que les longs pans. Le sommet du pignon est ainsi remplacé par une petit versant.
in scheme: T26