noue
created: 2013-07-10T11:50:46+02:00
modified: 2016-04-15T15:03:58+02:00
status: 1
type: Concept
definition: Arête rentrante formée par la rencontre des versants de deux toits.
in scheme: T26
preferred label: valley @en