pignon découvert
created: 2013-07-10T11:50:46+02:00
modified: 2016-04-15T15:33:54+02:00
status: 1
type: Concept
broad match: http://data.bnf.fr/ark:/12148/cb11953282b
broad match: Pignon (architecture)
broad match: http://vocab.getty.edu/aat/300002296
broader: T26-53
definition: Pignon se prolongeant au-dessus des versants
in scheme: T26