causeEffet
type: ObjectProperty
sub property of: related

actionProduction
type: ObjectProperty
sub property of: related

broaderGeneric
type: ObjectProperty
sub property of: broader
inverse of: narrowerGeneric

narrowerGeneric
type: ObjectProperty
sub property of: narrower
inverse of: broaderGeneric

broaderPartitive
type: ObjectProperty
sub property of: broader
inverse of: narrowerPartitive

narrowerPartitive
type: ObjectProperty
sub property of: narrower
inverse of: broaderPartitive

narrowerInstantive
type: ObjectProperty
sub property of: narrower
inverse of: broaderInstantive

broaderInstantive
type: ObjectProperty
sub property of: broader
inverse of: narrowerInstantive

TermeAssocie
type: ObjectProperty
sub property of: related

CustomConceptAttribute
type: DatatypeProperty

status
type: DatatypeProperty

Type de la couverture - Inventaire/MH
type: ConceptScheme
creator: Inventaire général du patrimoine culturel
publisher: Ministère de la culture et de la communication
description: Vocabulaire contrôlé du champ COUV du système descriptif de l'architecture. Type de la couverture et forme du toit.
modified: 2016-06-02T10:52:55+02:00
type: Liste contrôlée
rights: Licence Ouverte / Open Licence version 2.0
subject: description matérielle
subject: type de couverture
language: fr-FR
language: en
has top concept: terrasse
has top concept: croupe
has top concept: noue
has top concept: pignon
has top concept: couverture de plan allongé
has top concept: verrière
has top concept: demi-croupe
has top concept: lanterneau
has top concept: extrados de voûte
has top concept: couverture de plan massé
created: 2013-07-10T11:50:46+02:00
source: Pérouse de Montclos, Jean-Marie, Architecture : description et vocabulaire méthodiques / Inventaire général du patrimoine culturel, Nouvelle éd. , Paris, Éd. du Patrimoine-Centre des monuments nationaux, 2011
issued: Version 2016
date submitted: 2019-11-22T08:32:46.212+01:00
date submitted: 2022-02-10T13:38:17.289+01:00

flèche rhomboïdale
type: Concept
modified: 2016-04-14T17:27:05+02:00
in scheme: Type de la couverture - Inventaire/MH
broader: toit rhomboïdal
created: 2013-07-10T11:50:46+02:00
definition: Couverture à versants en losange ayant un grand développement en hauteur et couvrant un bâtiment carré ou polygonal dont toutes les faces se terminent en pignons : chaque losange est dessiné par les rampants de deux pignons contigus et par le arêtes qui prennent naissance au sommet des pignons et s'achèvent en une pointe commune.
status: 1

toit rhomboïdal
type: Concept
modified: 2013-07-10T00:00:00+02:00
in scheme: Type de la couverture - Inventaire/MH
narrower: flèche rhomboïdale
broader: couverture non galbée de plan massé
created: 2013-07-10T11:50:46+02:00
definition: Toit à versants en losange couvrant un bâtiment carré ou polygonal dont toutes les faces se terminent en pignons : chaque losange est dessiné par les rampants de deux pignons contigus et par les arêtes qui prennent naissance au sommet des pignons et s'achèvent en une pointe commune. Le toit rhomboïdal présente souvent une arête supplémentaire, partant de la naissance des pignons et "brisant" le losange en deux versants.
status: 1

flèche rhomboïdale
type: PreferredTerm
modified: 2016-04-14T17:27:05+02:00
created: 2013-07-10T11:50:46+02:00
status: 1

dôme carré
type: Concept
modified: 2016-04-14T12:01:16+02:00
in scheme: Type de la couverture - Inventaire/MH
broader: dôme polygonal
created: 2013-07-10T11:50:46+02:00
status: 1

dôme carré
type: PreferredTerm
modified: 2016-04-14T12:01:16+02:00
created: 2013-07-10T11:50:46+02:00
status: 1

dôme polygonal
type: Concept
modified: 2016-04-14T11:53:01+02:00
in scheme: Type de la couverture - Inventaire/MH
narrower: dôme carré
narrower: dôme rectangulaire
broader: dôme
created: 2013-07-10T11:50:46+02:00
status: 1
broad match: http://vocab.getty.edu/aat/300001280
broad match: http://data.bnf.fr/ark:/12148/cb119318943
broad match: Dôme (architecture)

toit en double bâtière
type: Concept
modified: 2016-04-14T15:30:42+02:00
in scheme: Type de la couverture - Inventaire/MH
broader: toit en bâtière
created: 2013-07-10T11:50:46+02:00
definition: Toit formé de deux bâtières transversales l'une par rapport à l'autre sur un plan carré ou sensiblement carré. Le toit en double-bâtière est donc compris entre quatre pignons contigus qu'il ne recouvre pas. Na pas appeler toit en double-bâtière la toiture de deux corps de bâtiments transversaux et couverts d'un toit à deux versants.
status: 1

toit en double bâtière
type: PreferredTerm
modified: 2016-06-02T10:56:03+02:00
created: 2013-07-10T11:50:46+02:00
status: 1

toit en bâtière
type: Concept
modified: 2016-04-14T15:23:25+02:00
in scheme: Type de la couverture - Inventaire/MH
narrower: toit en double bâtière
narrower: toit en triple bâtière
broader: toit à deux pans de plan massé
created: 2013-07-10T11:50:46+02:00
definition: Toit à deux versants et à pignons découverts, couvrant un corps de plan massé, notamment une tour.
status: 1

terrasse
type: Concept
modified: 2016-06-02T10:52:50+02:00
in scheme: Type de la couverture - Inventaire/MH
created: 2013-07-10T11:50:46+02:00
definition: Couverture horizontale d'un bâtiment. Ne pas confondre la terrasse de couverture et la terrasse en terre-plein. Ne pas confondre la terrasse étroite avec le balcon qui est en surplomb.
status: 1

terrasse
type: PreferredTerm
modified: 2016-06-02T10:52:50+02:00
created: 2013-07-10T11:50:46+02:00
status: 1

toit à longs pans
type: Concept
modified: 2016-04-13T16:48:06+02:00
in scheme: Type de la couverture - Inventaire/MH
narrower: toit à longs pans brisés
narrower: toit à égout retroussé
broader: couverture non galbée de plan allongé
created: 2013-07-10T11:50:46+02:00
related: toit à deux pans de plan massé
definition: Toit de forme allongée à deux versants principaux.
TermeAssocie: toit à deux pans de plan massé
status: 1

toit à longs pans brisés
type: Concept
modified: 2016-04-13T17:01:48+02:00
in scheme: Type de la couverture - Inventaire/MH
broader: toit à longs pans
created: 2013-07-10T11:50:46+02:00
definition: Toit présentant deux pentes différentes sur le même versant, séparées par une arête saillante, la ligne de brisis.
status: 1

toit à égout retroussé
type: Concept
modified: 2016-06-01T15:10:47+02:00
in scheme: Type de la couverture - Inventaire/MH
broader: toit à longs pans
alternative label: toit à longs pans inversés
created: 2013-07-10T11:50:46+02:00
definition: Toit dont les versants sont brisés par une arête rentrante dans la partie basse, de manière que la pente de l'égout soit moins forte que la pente générale.
status: 1

toit à deux pans de plan massé
type: Concept
modified: 2016-06-01T15:45:05+02:00
in scheme: Type de la couverture - Inventaire/MH
narrower: toit en bâtière
broader: couverture non galbée de plan massé
alternative label: toit à deux pans
created: 2013-07-10T11:50:46+02:00
related: toit à longs pans
definition: Toit de plan massé à deux versants principaux.
TermeAssocie: toit à longs pans
status: 1

toit à longs pans
type: PreferredTerm
modified: 2016-04-13T16:48:06+02:00
created: 2013-07-10T11:50:46+02:00
status: 1

couverture non galbée de plan allongé
type: Concept
modified: 2013-07-10T00:00:00+02:00
in scheme: Type de la couverture - Inventaire/MH
narrower: toit à longs pans
narrower: shed
narrower: toit à un pan
broader: couverture de plan allongé
created: 2013-07-10T11:50:46+02:00
status: 1

croupe
type: Concept
modified: 2016-04-15T13:50:31+02:00
in scheme: Type de la couverture - Inventaire/MH
narrower: croupe polygonale
narrower: croupe brisée
narrower: croupe ronde
created: 2013-07-10T11:50:46+02:00
definition: Petit versant réunissant à leur extrémité les longs-pans de certains toits allongés.
status: 1

croupe polygonale
type: Concept
modified: 2016-04-15T14:19:32+02:00
in scheme: Type de la couverture - Inventaire/MH
broader: croupe
created: 2013-07-10T11:50:46+02:00
definition: Croupe couvrant l'extrémité polygonale d'un bâtiment.
status: 1
broad match: Croupe (architecture)

croupe
type: PreferredTerm
modified: 2016-04-15T13:50:31+02:00
created: 2013-07-10T11:50:46+02:00
status: 1

croupe brisée
type: Concept
modified: 2016-04-15T14:05:31+02:00
in scheme: Type de la couverture - Inventaire/MH
broader: croupe
created: 2013-07-10T11:50:46+02:00
definition: Croupe dont le versant présente deux pentes différentes, séparées par une arête saillante.
status: 1
broad match: Croupe (architecture)

croupe ronde
type: Concept
modified: 2016-04-15T14:25:09+02:00
in scheme: Type de la couverture - Inventaire/MH
broader: croupe
created: 2013-07-10T11:50:46+02:00
definition: Croupe couvrant l'extrémité circulaire d'un bâtiment.
status: 1
broad match: Croupe (architecture)

noue
type: Concept
modified: 2016-04-15T15:03:58+02:00
in scheme: Type de la couverture - Inventaire/MH
preferred label: valley @en
created: 2013-07-10T11:50:46+02:00
definition: Arête rentrante formée par la rencontre des versants de deux toits.
status: 1

valley
type: PreferredTerm
modified: 2016-04-15T15:03:58+02:00
created: 2016-04-15T14:59:55+02:00
status: 1

noue
type: PreferredTerm
modified: 2016-04-15T15:03:58+02:00
created: 2013-07-10T11:50:46+02:00
status: 1

toit à plusieurs pans
type: Concept
modified: 2016-04-14T15:38:43+02:00
in scheme: Type de la couverture - Inventaire/MH
narrower: toit à plusieurs pans brisés
broader: couverture non galbée de plan massé
created: 2013-07-10T11:50:46+02:00
status: 1

toit à plusieurs pans
type: PreferredTerm
modified: 2016-04-14T15:38:43+02:00
created: 2013-07-10T11:50:46+02:00
status: 1

couverture non galbée de plan massé
type: Concept
modified: 2013-07-10T00:00:00+02:00
in scheme: Type de la couverture - Inventaire/MH
narrower: toit rhomboïdal
narrower: toit à deux pans de plan massé
narrower: toit à plusieurs pans
narrower: toit polygonal
narrower: appentis massé
narrower: toit conique
broader: couverture de plan massé
created: 2013-07-10T11:50:46+02:00
status: 1

toit à plusieurs pans brisés
type: Concept
modified: 2016-04-14T15:40:35+02:00
in scheme: Type de la couverture - Inventaire/MH
broader: toit à plusieurs pans
created: 2013-07-10T11:50:46+02:00
status: 1

toit polygonal
type: Concept
modified: 2016-04-14T16:23:30+02:00
in scheme: Type de la couverture - Inventaire/MH
narrower: flèche polygonale
narrower: toit en pavillon
broader: couverture non galbée de plan massé
created: 2013-07-10T11:50:46+02:00
status: 1

flèche polygonale
type: Concept
modified: 2016-04-14T16:36:05+02:00
in scheme: Type de la couverture - Inventaire/MH
preferred label: polygonal spire @en
narrower: flèche carrée
broader: toit polygonal
created: 2013-07-10T11:50:46+02:00
status: 1
broad match: http://vocab.getty.edu/aat/300002360

toit en pavillon
type: Concept
modified: 2016-04-14T16:45:46+02:00
in scheme: Type de la couverture - Inventaire/MH
preferred label: pyramidal roof @en
narrower: toit brisé en pavillon
broader: toit polygonal
created: 2013-07-10T11:50:46+02:00
definition: Toit à quatre versants non galbés couvrant un corps de bâtiment carré ou sensiblement carré. Ses quatre versants forment à leur sommet une pointe ou un faîtage très court.
status: 1

toit polygonal
type: PreferredTerm
modified: 2016-04-14T16:23:30+02:00
created: 2013-07-10T11:50:46+02:00
status: 1

dôme
type: Concept
modified: 2016-04-14T11:21:55+02:00
in scheme: Type de la couverture - Inventaire/MH
preferred label: dome @en
narrower: dôme polygonal
narrower: dôme circulaire
narrower: dôme ovale
broader: couverture galbée de plan massé
created: 2013-07-10T11:50:46+02:00
definition: Toit de plan centré à versant continu ou à pans, galbé en quart de rond. Son plan est habituellement circulaire et son volume, une convexité de révolution.
status: 1

dôme circulaire
type: Concept
modified: 2016-04-14T11:38:49+02:00
in scheme: Type de la couverture - Inventaire/MH
broader: dôme
created: 2013-07-10T11:50:46+02:00
status: 1
broad match: http://vocab.getty.edu/aat/300001280
broad match: http://data.bnf.fr/ark:/12148/cb119318943
broad match: Dôme (architecture)

couverture galbée de plan massé
type: Concept
modified: 2013-07-10T00:00:00+02:00
in scheme: Type de la couverture - Inventaire/MH
narrower: dôme
narrower: toit à l'impériale
narrower: bulbe
broader: couverture de plan massé
created: 2013-07-10T11:50:46+02:00
status: 1

dôme ovale
type: Concept
modified: 2016-04-14T11:46:22+02:00
in scheme: Type de la couverture - Inventaire/MH
broader: dôme
created: 2013-07-10T11:50:46+02:00
status: 1
broad match: http://vocab.getty.edu/aat/300001280
broad match: http://data.bnf.fr/ark:/12148/cb119318943
broad match: Dôme (architecture)

dome
type: PreferredTerm
modified: 2016-04-14T11:21:55+02:00
created: 2016-04-14T11:15:48+02:00
status: 1

dôme
type: PreferredTerm
modified: 2016-04-14T11:21:55+02:00
created: 2013-07-10T11:50:46+02:00
status: 1

dôme rectangulaire
type: Concept
modified: 2016-04-14T12:15:40+02:00
in scheme: Type de la couverture - Inventaire/MH
broader: dôme polygonal
created: 2013-07-10T11:50:46+02:00
status: 1

dôme rectangulaire
type: PreferredTerm
modified: 2016-04-14T12:15:40+02:00
created: 2013-07-10T11:50:46+02:00
status: 1

pignon
type: Concept
modified: 2016-04-15T15:21:16+02:00
in scheme: Type de la couverture - Inventaire/MH
preferred label: gable @en
narrower: pignon découvert
narrower: ruellée
narrower: pignon couvert
created: 2013-07-10T11:50:46+02:00
definition: Partie supérieure d'un mur-pignon ou d'un mur-de-refend parallèle aux fermes, correspondant à la hauteur du comble, habituellement triangulaire.
status: 1

gable
type: PreferredTerm
modified: 2016-04-15T15:21:16+02:00
created: 2016-04-15T15:21:16+02:00
status: 1

pignon découvert
type: Concept
modified: 2016-04-15T15:33:54+02:00
in scheme: Type de la couverture - Inventaire/MH
broader: pignon
created: 2013-07-10T11:50:46+02:00
definition: Pignon se prolongeant au-dessus des versants
status: 1
broad match: http://vocab.getty.edu/aat/300002296
broad match: http://data.bnf.fr/ark:/12148/cb11953282b
broad match: Pignon (architecture)

pignon
type: PreferredTerm
modified: 2016-04-15T15:21:16+02:00
created: 2013-07-10T11:50:46+02:00
status: 1

ruellée
type: Concept
modified: 2016-04-15T16:01:46+02:00
in scheme: Type de la couverture - Inventaire/MH
preferred label: cement fillet @en
broader: pignon
created: 2013-07-10T11:50:46+02:00
definition: Chape en mortier posée sur un rampant de pignon et sur la rive du versant qui recouvre partiellement ce rampant.
status: 1

pignon couvert
type: Concept
modified: 2016-04-15T15:27:59+02:00
in scheme: Type de la couverture - Inventaire/MH
broader: pignon
created: 2013-07-10T11:50:46+02:00
definition: Pignon portant les versants.
status: 1
broad match: http://vocab.getty.edu/aat/300002296
broad match: http://data.bnf.fr/ark:/12148/cb11953282b
broad match: Pignon (architecture)

couverture galbée de plan allongé
type: Concept
modified: 2013-07-10T00:00:00+02:00
in scheme: Type de la couverture - Inventaire/MH
narrower: toit bombé
narrower: toit en carène
broader: couverture de plan allongé
created: 2013-07-10T11:50:46+02:00
status: 1

couverture de plan allongé
type: Concept
modified: 2013-07-10T00:00:00+02:00
in scheme: Type de la couverture - Inventaire/MH
narrower: couverture non galbée de plan allongé
narrower: couverture galbée de plan allongé
created: 2013-07-10T11:50:46+02:00
status: 1

toit bombé
type: Concept
modified: 2016-04-13T15:41:56+02:00
in scheme: Type de la couverture - Inventaire/MH
broader: couverture galbée de plan allongé
created: 2013-07-10T11:50:46+02:00
status: 1

toit en carène
type: Concept
modified: 2016-04-13T15:56:44+02:00
in scheme: Type de la couverture - Inventaire/MH
broader: couverture galbée de plan allongé
created: 2013-07-10T11:50:46+02:00
definition: Toit à deux versants galbés en quart-de-rond, en doucine, en talon renversé ou en un quelconque profil évoquant par sa forme la carène d'un navire. Son galbe est celui du toit à l'impériale dont il ne se distingue que par son plan allongé.
status: 1

couverture galbée de plan allongé
type: PreferredTerm
modified: 2013-07-10T00:00:00+02:00
created: 2013-07-10T11:50:46+02:00
status: 1

shed
type: Concept
modified: 2016-04-13T16:41:14+02:00
in scheme: Type de la couverture - Inventaire/MH
preferred label: sawtooth roof @en
narrower: shed ovoïde
broader: couverture non galbée de plan allongé
created: 2013-07-10T11:50:46+02:00
definition: Toit à deux versants de pente différente, le versant le plus court et le plus incliné étant vitré et recevant la lumière par le nord. Les sheds couvrant en dents-de-scie les bâtiments industriels donnent un éclairage idéal pour les activités qui s'y exercent.
status: 1

shed
type: PreferredTerm
modified: 2016-04-13T16:41:14+02:00
created: 2013-07-10T11:50:46+02:00
status: 1

shed ovoïde
type: Concept
modified: 2016-04-13T16:23:06+02:00
in scheme: Type de la couverture - Inventaire/MH
broader: shed
created: 2013-07-10T11:50:46+02:00
status: 1
broad match: Shed (architecture)
broad match: http://vocab.getty.edu/aat/300002162

sawtooth roof
type: PreferredTerm
modified: 2016-04-13T16:41:14+02:00
created: 2016-04-13T16:41:14+02:00
status: 1

appentis massé
type: Concept
modified: 2016-04-14T14:38:38+02:00
in scheme: Type de la couverture - Inventaire/MH
narrower: appentis massé brisé
broader: couverture non galbée de plan massé
created: 2013-07-10T11:50:46+02:00
definition: Toit à un seul versant, de plan massé, dont le faîte s'appuie sur ou contre un mur.
status: 1

appentis massé brisé
type: Concept
modified: 2013-07-10T00:00:00+02:00
in scheme: Type de la couverture - Inventaire/MH
broader: appentis massé
created: 2013-07-10T11:50:46+02:00
definition: Toit présentant deux pentes différentes séparées par une arête saillante sur son seul versant et appuyé sur ou contre un mur.
status: 1

appentis massé
type: PreferredTerm
modified: 2016-04-14T14:38:38+02:00
created: 2013-07-10T11:50:46+02:00
status: 1

toit en triple bâtière
type: Concept
modified: 2013-07-10T00:00:00+02:00
in scheme: Type de la couverture - Inventaire/MH
broader: toit en bâtière
created: 2013-07-10T11:50:46+02:00
definition: Toit formé de trois bâtières transversales couvrant un corps de plan hexagonal et présentant six pignons contigus.
status: 1

toit en triple bâtière
type: PreferredTerm
modified: 2013-07-10T00:00:00+02:00
created: 2013-07-10T11:50:46+02:00
status: 1

verrière
type: Concept
modified: 2016-04-13T14:41:28+02:00
in scheme: Type de la couverture - Inventaire/MH
created: 2013-07-10T11:50:46+02:00
definition: Couverture formée d'une charpente vitrée ou de dalles en verre.
status: 1

verrière
type: PreferredTerm
modified: 2016-04-13T14:41:28+02:00
created: 2013-07-10T11:50:46+02:00
status: 1

flèche carrée
type: Concept
modified: 2016-04-14T16:39:04+02:00
in scheme: Type de la couverture - Inventaire/MH
preferred label: pyramidal spire @en
broader: flèche polygonale
created: 2013-07-10T11:50:46+02:00
status: 1
broad match: http://vocab.getty.edu/aat/300002360

flèche carrée
type: PreferredTerm
modified: 2016-04-14T16:39:04+02:00
created: 2013-07-10T11:50:46+02:00
status: 1

pyramidal spire
type: PreferredTerm
modified: 2016-04-14T16:39:04+02:00
created: 2016-04-14T16:36:42+02:00
status: 1

toit à longs pans brisés
type: PreferredTerm
modified: 2016-04-13T17:01:48+02:00
created: 2013-07-10T11:50:46+02:00
status: 1

croupe brisée
type: PreferredTerm
modified: 2016-04-15T14:05:31+02:00
created: 2013-07-10T11:50:46+02:00
status: 1

cement fillet
type: PreferredTerm
modified: 2016-04-15T16:01:46+02:00
created: 2016-04-15T15:38:31+02:00
status: 1

ruellée
type: PreferredTerm
modified: 2016-04-15T16:01:46+02:00
created: 2013-07-10T11:50:46+02:00
status: 1

demi-croupe
type: Concept
modified: 2016-04-15T14:36:16+02:00
in scheme: Type de la couverture - Inventaire/MH
created: 2013-07-10T11:50:46+02:00
definition: Croupe qui ne descend pas aussi bas que les longs pans. Le sommet du pignon est ainsi remplacé par une petit versant.
status: 1

demi-croupe
type: PreferredTerm
modified: 2016-04-15T14:36:16+02:00
created: 2013-07-10T11:50:46+02:00
status: 1

toit à l'impériale
type: Concept
modified: 2016-04-14T14:29:35+02:00
in scheme: Type de la couverture - Inventaire/MH
broader: couverture galbée de plan massé
created: 2013-07-10T11:50:46+02:00
definition: ​Toit de plan centré à versant continu ou à pans, galbé en doucine ou en talon renversé. Ne pas confondre le toit à l'impériale avec le bulbe.
status: 1

toit à l'impériale
type: PreferredTerm
modified: 2016-04-14T14:29:35+02:00
created: 2013-07-10T11:50:46+02:00
status: 1

toit bombé
type: PreferredTerm
modified: 2016-04-13T15:41:56+02:00
created: 2013-07-10T11:50:46+02:00
status: 1

polygonal spire
type: PreferredTerm
modified: 2016-04-14T16:36:05+02:00
created: 2016-04-14T16:36:05+02:00
status: 1

flèche polygonale
type: PreferredTerm
modified: 2016-04-14T16:36:05+02:00
created: 2013-07-10T11:50:46+02:00
status: 1

lanterneau
type: Concept
modified: 2016-04-15T14:56:29+02:00
in scheme: Type de la couverture - Inventaire/MH
preferred label: lantern @en
created: 2013-07-10T11:50:46+02:00
definition: Petite construction basse, généralement de plan carré ou rectangulaire, percée de fenêtres et placée au faîte d'un toit. Le lanterneau sert habituellement à donner de la lumière aux parties sous le toit. Il se distingue du lanternon par son volume écrasé. Ne pas confondre le lanterneau avec le belvédère.
status: 1

lantern
type: PreferredTerm
modified: 2016-04-15T14:56:29+02:00
created: 2016-04-15T14:43:19+02:00
status: 1

lanterneau
type: PreferredTerm
modified: 2016-04-15T14:56:29+02:00
created: 2013-07-10T11:50:46+02:00
status: 1

shed ovoïde
type: PreferredTerm
modified: 2016-04-13T16:23:06+02:00
created: 2013-07-10T11:50:46+02:00
status: 1

dôme circulaire
type: PreferredTerm
modified: 2016-04-14T11:38:49+02:00
created: 2013-07-10T11:50:46+02:00
status: 1

pyramidal roof
type: PreferredTerm
modified: 2016-04-14T16:45:46+02:00
created: 2016-04-14T16:45:46+02:00
status: 1

toit en pavillon
type: PreferredTerm
modified: 2016-04-14T16:45:46+02:00
created: 2013-07-10T11:50:46+02:00
status: 1

toit brisé en pavillon
type: Concept
modified: 2016-04-14T16:56:01+02:00
in scheme: Type de la couverture - Inventaire/MH
broader: toit en pavillon
created: 2013-07-10T11:50:46+02:00
definition: Toit à quatre versants non galbés, présentant chacun deux pentes différentes séparées par une arête saillante et couvrant un corps de bâtiment carré ou sensiblement carré.
status: 1
broad match: http://vocab.getty.edu/aat/300002150
broad match: http://data.bnf.fr/ark:/12148/cb167692841

dôme ovale
type: PreferredTerm
modified: 2016-04-14T11:46:22+02:00
created: 2013-07-10T11:50:46+02:00
status: 1

toit conique
type: Concept
modified: 2016-04-14T15:47:04+02:00
in scheme: Type de la couverture - Inventaire/MH
preferred label: conical roof @en
narrower: flèche conique
broader: couverture non galbée de plan massé
created: 2013-07-10T11:50:46+02:00
definition: Toit en forme de cône.
status: 1

toit conique
type: PreferredTerm
modified: 2016-04-14T15:47:04+02:00
created: 2013-07-10T11:50:46+02:00
status: 1

conical roof
type: PreferredTerm
modified: 2016-04-14T15:47:04+02:00
created: 2016-04-14T15:47:04+02:00
status: 1

flèche conique
type: Concept
modified: 2016-04-14T16:35:21+02:00
in scheme: Type de la couverture - Inventaire/MH
preferred label: conical spire @en
broader: toit conique
created: 2013-07-10T11:50:46+02:00
definition: Couverture en forme de cône ayant un grand développement dans sa hauteur.
status: 1
broad match: http://vocab.getty.edu/aat/300002360

toit à deux pans
type: SimpleNonPreferredTerm
modified: 2016-06-01T15:45:05+02:00
created: 2013-07-10T11:50:46+02:00
status: 1

toit à deux pans de plan massé
type: PreferredTerm
modified: 2016-06-01T15:45:05+02:00
created: 2016-06-01T15:18:12+02:00
status: 1

toit brisé en pavillon
type: PreferredTerm
modified: 2016-04-14T16:56:01+02:00
created: 2013-07-10T11:50:46+02:00
status: 1

toit à longs pans inversés
type: SimpleNonPreferredTerm
modified: 2016-06-01T15:10:47+02:00
created: 2013-07-10T11:50:46+02:00
status: 1

toit à égout retroussé
type: PreferredTerm
modified: 2016-06-01T15:10:47+02:00
created: 2016-06-01T15:03:58+02:00
status: 1

appentis massé brisé
type: PreferredTerm
modified: 2013-07-10T00:00:00+02:00
created: 2013-07-10T11:50:46+02:00
status: 1

extrados de voûte
type: Concept
modified: 2016-04-13T12:31:51+02:00
in scheme: Type de la couverture - Inventaire/MH
preferred label: extrados @en
narrower: flèche en maçonnerie
created: 2013-07-10T11:50:46+02:00
definition: Voûte dont la surface supérieure, arquée ou pyramidée, à l'air libre forme couverture.
status: 1

extrados de voûte
type: PreferredTerm
modified: 2016-04-13T12:31:51+02:00
created: 2013-07-10T11:50:46+02:00
status: 1

extrados
type: PreferredTerm
modified: 2016-04-13T12:31:51+02:00
created: 2016-04-13T11:02:51+02:00
status: 1

flèche en maçonnerie
type: Concept
modified: 2016-04-13T12:56:45+02:00
in scheme: Type de la couverture - Inventaire/MH
broader: extrados de voûte
created: 2013-07-10T11:50:46+02:00
definition: Couverture de plan centré ayant un grand développement en hauteur : sa hauteur est supérieure à la largeur de sa base. Ce type de flèche est réalisé en maçonnerie et non en matériaux de couverture.
status: 1

croupe ronde
type: PreferredTerm
modified: 2016-04-15T14:25:09+02:00
created: 2013-07-10T11:50:46+02:00
status: 1

croupe polygonale
type: PreferredTerm
modified: 2016-04-15T14:19:32+02:00
created: 2013-07-10T11:50:46+02:00
status: 1

toit en carène
type: PreferredTerm
modified: 2016-04-13T15:56:44+02:00
created: 2013-07-10T11:50:46+02:00
status: 1

couverture de type complexe
type: Concept
modified: 2016-06-02T10:38:46+02:00
in scheme: Type de la couverture - Inventaire/MH
created: 2016-06-01T15:11:30+02:00
definition: Toit composé de plusieurs versants de forme et de taille diverses et pouvant suivre des pentes variées.
status: 1

couverture de type complexe
type: PreferredTerm
modified: 2016-06-02T10:38:46+02:00
created: 2016-06-01T15:11:30+02:00
status: 1

couverture non galbée de plan massé
type: PreferredTerm
modified: 2013-07-10T00:00:00+02:00
created: 2013-07-10T11:50:46+02:00
status: 1

couverture de plan massé
type: Concept
modified: 2013-07-10T00:00:00+02:00
in scheme: Type de la couverture - Inventaire/MH
narrower: couverture non galbée de plan massé
narrower: couverture galbée de plan massé
created: 2013-07-10T11:50:46+02:00
status: 1

pignon découvert
type: PreferredTerm
modified: 2016-04-15T15:33:54+02:00
created: 2013-07-10T11:50:46+02:00
status: 1

couverture de plan massé
type: PreferredTerm
modified: 2013-07-10T00:00:00+02:00
created: 2013-07-10T11:50:46+02:00
status: 1

bulbe
type: Concept
modified: 2016-04-14T11:00:05+02:00
in scheme: Type de la couverture - Inventaire/MH
preferred label: onion dome @en
broader: couverture galbée de plan massé
created: 2013-07-10T11:50:46+02:00
definition: Toit de plan centré à versant continu ou à pans, galbé suivant une courbe alternativement concave ou convexe, les parties convexes formant des renflements qui surplombent les parties concaves : ces renflements distinguent le bulbe du toit à l'impériale dont le volume diminue progressivement suivant le galbe.
status: 1
narrow match: Clocher à bulbe

couverture galbée de plan massé
type: PreferredTerm
modified: 2013-07-10T00:00:00+02:00
created: 2013-07-10T11:50:46+02:00
status: 1

dôme polygonal
type: PreferredTerm
modified: 2016-04-14T11:53:01+02:00
created: 2013-07-10T11:50:46+02:00
status: 1

toit rhomboïdal
type: PreferredTerm
modified: 2013-07-10T00:00:00+02:00
created: 2013-07-10T11:50:46+02:00
status: 1

flèche conique
type: PreferredTerm
modified: 2016-04-14T16:35:21+02:00
created: 2013-07-10T11:50:46+02:00
status: 1

conical spire
type: PreferredTerm
modified: 2016-04-14T16:35:21+02:00
created: 2016-04-14T16:35:21+02:00
status: 1

toit en bâtière
type: PreferredTerm
modified: 2016-04-14T15:23:25+02:00
created: 2013-07-10T11:50:46+02:00
status: 1

flèche en maçonnerie
type: PreferredTerm
modified: 2016-04-13T12:56:45+02:00
created: 2013-07-10T11:50:46+02:00
status: 1

toit à un pan
type: Concept
modified: 2016-04-14T10:31:50+02:00
in scheme: Type de la couverture - Inventaire/MH
narrower: appentis
broader: couverture non galbée de plan allongé
created: 2013-07-10T11:50:46+02:00
status: 1

appentis
type: Concept
modified: 2016-04-14T10:40:06+02:00
in scheme: Type de la couverture - Inventaire/MH
preferred label: shed roof @en
broader: toit à un pan
created: 2013-07-10T11:50:46+02:00
definition: Toit à un seul versant dont le faîte s'appuie sur ou contre un mur.
status: 1

toit à un pan
type: PreferredTerm
modified: 2016-04-14T10:31:50+02:00
created: 2013-07-10T11:50:46+02:00
status: 1

couverture non galbée de plan allongé
type: PreferredTerm
modified: 2013-07-10T00:00:00+02:00
created: 2013-07-10T11:50:46+02:00
status: 1

appentis
type: PreferredTerm
modified: 2016-04-14T10:40:06+02:00
created: 2013-07-10T11:50:46+02:00
status: 1

shed roof
type: PreferredTerm
modified: 2016-04-14T10:40:06+02:00
created: 2016-04-13T16:17:30+02:00
status: 1

toit à plusieurs pans brisés
type: PreferredTerm
modified: 2016-04-14T15:40:35+02:00
created: 2013-07-10T11:50:46+02:00
status: 1

couverture de plan allongé
type: PreferredTerm
modified: 2013-07-10T00:00:00+02:00
created: 2013-07-10T11:50:46+02:00
status: 1

pignon couvert
type: PreferredTerm
modified: 2016-04-15T15:27:59+02:00
created: 2013-07-10T11:50:46+02:00
status: 1

onion dome
type: PreferredTerm
modified: 2016-04-14T11:00:06+02:00
created: 2016-04-14T11:00:05+02:00
status: 1

bulbe
type: PreferredTerm
modified: 2016-04-14T11:00:05+02:00
created: 2013-07-10T11:50:46+02:00
status: 1

type de couverture
type: Collection
modified: 2016-06-02T10:44:52+02:00
in scheme: Type de la couverture - Inventaire/MH
created: 2016-06-02T10:43:54+02:00
member: terrasse
member: verrière
member: extrados de voûte

partie de toit
type: Collection
modified: 2016-06-02T10:45:47+02:00
in scheme: Type de la couverture - Inventaire/MH
created: 2016-06-02T10:40:45+02:00
member: croupe
member: noue
member: pignon
member: demi-croupe
member: lanterneau

forme du toit
type: Collection
modified: 2016-06-02T10:40:14+02:00
in scheme: Type de la couverture - Inventaire/MH
created: 2016-06-02T10:33:58+02:00
member: couverture de plan allongé
member: couverture de plan massé