escalier en équerre
created: 2013-05-21T17:19:09+02:00
modified: 2016-05-31T12:24:39+02:00
status: 1
type: Concept
broader: T29-1
definition: Escalier à un seul retour à 90°. Il est constitué par une seule volée à quartier-tournant ou par deux volées tournant sur un repos.
in scheme: T29