escalier en vis
created: 2013-05-21T17:19:09+02:00
modified: 2016-04-18T14:50:25+02:00
status: 1
type: Concept
broader: T29-14
definition: Escalier tournant formé uniquement de marches gironnées. Les volées sont formées de marches portant noyau, de marches reposant sur des faux-limons en crémaillère, ou sur une voûte en berceau hélicoïdal.
in scheme: T29
narrower: T29-16
narrower: T29-17
preferred label: spiral stairs @en