escalier en vis avec jour
created: 2013-05-21T17:19:09+02:00
modified: 2016-04-18T16:04:56+02:00
status: 1
type: Concept
broad match: cb16768593k
broader: T29-15
definition: Escalier en vis se développant autour d'un jour central.
in scheme: T29