escalier tournant à retours avec jour
created: 2013-05-21T17:19:09+02:00
modified: 2016-04-18T16:05:50+02:00
status: 1
type: Concept
broader: T29-18
definition: Escalier présentant plus d'un retour et qui se développe autour d'un jour central.
in scheme: T29