escalier tournant à retours sans jour
created: 2013-05-21T17:19:09+02:00
modified: 2016-04-18T15:48:49+02:00
status: 1
type: Concept
broader: T29-18
definition: Escalier présentant plus d'un retour, sans jour central.
in scheme: T29