escalier sur voûte
created: 2013-05-21T17:19:09+02:00
modified: 2016-05-31T14:24:36+02:00
status: 1
type: Concept
broader: T29-1
definition: Escalier dont les volées suspendues sont portées par des voûtes.
hidden label: sur voûte
in scheme: T29