escalier suspendu
created: 2013-05-21T17:19:09+02:00
modified: 2016-05-31T14:23:28+02:00
status: 1
type: Concept
broader: T29-1
definition: Escalier dont les volées sont en surplomb : elles n'ont d'appui qu'un seul côté.
hidden label: suspendu
in scheme: T29
preferred label: flying stairs @en