rampe d'accès
created: 2013-05-21T17:19:09+02:00
modified: 2016-04-18T16:53:45+02:00
status: 1
type: Concept
definition: Ouvrage en pente permettant de passer d'un plan à un autre, pouvant être ouvert aux animaux et véhicules. Les rampes sont parfois coupées par des pas-d'âne (marches rampantes très basses et espacées).
in scheme: T29
preferred label: ramp @en