escalier demi-hors-oeuvre
created: 2013-05-21T17:19:09+02:00
modified: 2016-05-30T17:31:23+02:00
status: 1
type: Concept
broader: T29-5
definition: Escalier construit dans une tour ou un pavillon demi-hors-oeuvre par rapport au bâtiment que cet escalier distribue.
hidden label: escalier demi-hors-œuvre
in scheme: T29