escalier hors-oeuvre
created: 2013-05-21T17:19:09+02:00
modified: 2016-05-30T17:30:58+02:00
status: 1
type: Concept
broader: T29-5
definition: Escalier construit dans une tour ou un pavillon hors-œuvre par rapport au bâtiment que cet escalier distribue.
hidden label: escalier hors-œuvre
in scheme: T29