causeEffet
type: ObjectProperty
sub property of: related

actionProduction
type: ObjectProperty
sub property of: related

broaderGeneric
type: ObjectProperty
sub property of: broader
inverse of: narrowerGeneric

narrowerGeneric
type: ObjectProperty
sub property of: narrower
inverse of: broaderGeneric

broaderPartitive
type: ObjectProperty
sub property of: broader
inverse of: narrowerPartitive

narrowerPartitive
type: ObjectProperty
sub property of: narrower
inverse of: broaderPartitive

narrowerInstantive
type: ObjectProperty
sub property of: narrower
inverse of: broaderInstantive

broaderInstantive
type: ObjectProperty
sub property of: broader
inverse of: narrowerInstantive

TermeAssocie
type: ObjectProperty
sub property of: related

CustomConceptAttribute
type: DatatypeProperty

status
type: DatatypeProperty

Lexique de l'escalier et des autres organes de circulation : emplacement, forme et structure - Inventaire/MH
type: ConceptScheme
creator: Inventaire général du patrimoine culturel
publisher: Ministère de la culture et de la communication
description: Emplacement, forme et structure de l'escalier principal.
modified: 2016-05-31T17:39:41+02:00
type: Liste contrôlée
rights: CC-BY-SA
subject: description matérielle
subject: escalier
language: fr-FR
language: en
has top concept: escalier
has top concept: toboggan de manutention
has top concept: ascenseur
has top concept: escalier mécanique
has top concept: rampe d'accès
created: 2013-05-21T17:19:09+02:00
issued: Version 2016
date submitted: 2022-03-17T17:09:53.814+01:00

escalier de distribution
type: Concept
modified: 2016-05-31T12:13:16+02:00
in scheme: Lexique de l'escalier et des autres organes de circulation : emplacement, forme et structure - Inventaire/MH
narrower: escalier de distribution extérieur
narrower: escalier intérieur
broader: escalier
created: 2013-05-21T17:19:09+02:00
definition: Ouvrage formé de marches permettant d'accéder aux étages d'un bâtiment.
status: 1

escalier de distribution extérieur
type: Concept
modified: 2016-04-18T10:49:30+02:00
in scheme: Lexique de l'escalier et des autres organes de circulation : emplacement, forme et structure - Inventaire/MH
broader: escalier de distribution
created: 2013-05-21T17:19:09+02:00
definition: Escalier sans cage construit contre la façade d'un bâtiment.
status: 1

escalier
type: Concept
modified: 2016-04-18T10:26:39+02:00
in scheme: Lexique de l'escalier et des autres organes de circulation : emplacement, forme et structure - Inventaire/MH
preferred label: stairs @en
narrower: escalier de distribution
narrower: escalier de type complexe
narrower: escalier isolé
narrower: escalier en charpente
narrower: escalier tournant
narrower: cage ouverte
narrower: escalier en équerre
narrower: escalier sur voûte
narrower: escalier suspendu
narrower: escalier droit
narrower: échelle
narrower: escalier en maçonnerie
created: 2013-05-21T17:19:09+02:00
definition: Ouvrage formé de marches et permettant de passer d'un plan à un autre.
status: 1

escalier intérieur
type: Concept
modified: 2016-04-18T11:11:38+02:00
in scheme: Lexique de l'escalier et des autres organes de circulation : emplacement, forme et structure - Inventaire/MH
narrower: escalier hors-oeuvre
narrower: escalier dans-oeuvre
narrower: escalier demi-hors-oeuvre
broader: escalier de distribution
created: 2013-05-21T17:19:09+02:00
definition: Escalier compris dans le bâtiment qu'il distribue.
status: 1

escalier de distribution
type: PreferredTerm
modified: 2016-05-31T12:13:16+02:00
created: 2013-05-21T17:19:09+02:00
status: 1

escalier intérieur
type: PreferredTerm
modified: 2016-04-18T11:11:38+02:00
created: 2013-05-21T17:19:09+02:00
status: 1

escalier hors-oeuvre
type: Concept
modified: 2016-05-30T17:30:58+02:00
in scheme: Lexique de l'escalier et des autres organes de circulation : emplacement, forme et structure - Inventaire/MH
broader: escalier intérieur
created: 2013-05-21T17:19:09+02:00
hidden label: escalier hors-œuvre
definition: Escalier construit dans une tour ou un pavillon hors-œuvre par rapport au bâtiment que cet escalier distribue.
status: 1

escalier dans-oeuvre
type: Concept
modified: 2016-05-30T17:29:22+02:00
in scheme: Lexique de l'escalier et des autres organes de circulation : emplacement, forme et structure - Inventaire/MH
broader: escalier intérieur
created: 2013-05-21T17:19:09+02:00
hidden label: escalier dans-œuvre
status: 1
broad match: cb15086206k

escalier demi-hors-oeuvre
type: Concept
modified: 2016-05-30T17:31:23+02:00
in scheme: Lexique de l'escalier et des autres organes de circulation : emplacement, forme et structure - Inventaire/MH
broader: escalier intérieur
created: 2013-05-21T17:19:09+02:00
hidden label: escalier demi-hors-œuvre
definition: Escalier construit dans une tour ou un pavillon demi-hors-oeuvre par rapport au bâtiment que cet escalier distribue.
status: 1

escalier symétrique
type: Concept
modified: 2016-04-18T12:53:52+02:00
in scheme: Lexique de l'escalier et des autres organes de circulation : emplacement, forme et structure - Inventaire/MH
narrower: escalier en fer-à-cheval
broader: escalier de type complexe
created: 2013-05-21T17:19:09+02:00
status: 1

escalier en fer-à-cheval
type: Concept
modified: 2016-04-18T13:05:26+02:00
in scheme: Lexique de l'escalier et des autres organes de circulation : emplacement, forme et structure - Inventaire/MH
preferred label: horseshoe stairs @en
broader: escalier symétrique
created: 2013-05-21T17:19:09+02:00
definition: Escalier double à montées courbes convergentes au sommet.
status: 1

escalier symétrique
type: PreferredTerm
modified: 2016-04-18T12:53:52+02:00
created: 2013-05-21T17:19:09+02:00
status: 1

escalier de type complexe
type: Concept
modified: 2016-05-31T12:22:37+02:00
in scheme: Lexique de l'escalier et des autres organes de circulation : emplacement, forme et structure - Inventaire/MH
narrower: escalier symétrique
narrower: escalier à double révolution
broader: escalier
created: 2013-05-21T17:19:09+02:00
status: 1

escalier demi-hors-oeuvre
type: PreferredTerm
modified: 2016-05-30T17:31:23+02:00
created: 2015-03-06T08:37:12+01:00
status: 1

escalier demi-hors-œuvre
type: SimpleNonPreferredTerm
modified: 2016-05-30T17:31:23+02:00
created: 2013-05-21T17:19:09+02:00
status: 1

toboggan de manutention
type: Concept
modified: 2016-04-18T16:57:51+02:00
in scheme: Lexique de l'escalier et des autres organes de circulation : emplacement, forme et structure - Inventaire/MH
created: 2013-05-21T17:19:09+02:00
definition: Dispositif de descente constitué par un couloir de section appropriée, à trajet rectiligne, courbe ou hélicoïdal, utilisé pour acheminer par gravité des produits ou des objets d'un niveau à un autre.
status: 1

toboggan de manutention
type: PreferredTerm
modified: 2016-04-18T16:57:51+02:00
created: 2013-05-21T17:19:09+02:00
status: 1

escalier isolé
type: Concept
modified: 2016-05-31T12:12:42+02:00
in scheme: Lexique de l'escalier et des autres organes de circulation : emplacement, forme et structure - Inventaire/MH
broader: escalier
created: 2013-05-21T17:19:09+02:00
scope note: Penser à noter dans le champ PART : escalier indépendant.
definition: Escalier qui ne distribue pas un bâtiment, par exemple un escalier au milieu d'un jardin.
status: 1

escalier isolé
type: PreferredTerm
modified: 2016-05-31T12:12:42+02:00
created: 2013-05-21T17:19:09+02:00
status: 1

ascenseur
type: Concept
modified: 2016-04-18T16:36:11+02:00
in scheme: Lexique de l'escalier et des autres organes de circulation : emplacement, forme et structure - Inventaire/MH
preferred label: elevator @en
narrower: monte-charge
created: 2013-05-21T17:19:09+02:00
definition: Ouvrage mécanique de circulation verticale, généralement composé d'une cabine, se mouvant dans une cage et permettant de passer d'un plan à un autre.
status: 1

elevator
type: PreferredTerm
modified: 2016-04-18T16:36:11+02:00
created: 2016-04-18T16:36:11+02:00
status: 1

ascenseur
type: PreferredTerm
modified: 2016-04-18T16:36:11+02:00
created: 2013-05-21T17:19:09+02:00
status: 1

monte-charge
type: Concept
modified: 2016-04-18T16:41:09+02:00
in scheme: Lexique de l'escalier et des autres organes de circulation : emplacement, forme et structure - Inventaire/MH
preferred label: freight elevator @en
broader: ascenseur
created: 2013-05-21T17:19:09+02:00
status: 1

escalier en charpente
type: Concept
modified: 2016-05-31T14:25:27+02:00
in scheme: Lexique de l'escalier et des autres organes de circulation : emplacement, forme et structure - Inventaire/MH
narrower: escalier en charpente métallique
broader: escalier
created: 2013-05-21T17:19:09+02:00
hidden label: en charpente
status: 1

escalier en charpente métallique
type: Concept
modified: 2016-05-31T11:30:23+02:00
in scheme: Lexique de l'escalier et des autres organes de circulation : emplacement, forme et structure - Inventaire/MH
broader: escalier en charpente
created: 2013-05-21T17:19:09+02:00
hidden label: en charpente métallique
status: 1

en charpente
type: SimpleNonPreferredTerm
modified: 2016-05-31T14:25:27+02:00
created: 2013-05-21T17:19:09+02:00
status: 1

escalier en charpente
type: PreferredTerm
modified: 2016-05-31T14:25:27+02:00
created: 2016-05-30T17:17:04+02:00
status: 1

escalier tournant à retours avec jour
type: Concept
modified: 2016-04-18T16:05:50+02:00
in scheme: Lexique de l'escalier et des autres organes de circulation : emplacement, forme et structure - Inventaire/MH
broader: escalier tournant à retours
created: 2013-05-21T17:19:09+02:00
definition: Escalier présentant plus d'un retour et qui se développe autour d'un jour central.
status: 1

escalier tournant à retours avec jour
type: PreferredTerm
modified: 2016-04-18T16:05:51+02:00
created: 2013-05-21T17:19:09+02:00
status: 1

escalier tournant à retours
type: Concept
modified: 2016-04-18T15:31:31+02:00
in scheme: Lexique de l'escalier et des autres organes de circulation : emplacement, forme et structure - Inventaire/MH
narrower: escalier tournant à retours avec jour
narrower: escalier tournant à retours sans jour
broader: escalier tournant
created: 2013-05-21T17:19:09+02:00
definition: Escalier présentant plus d'un retour.
status: 1
broad match: cb16768593k

escalier mécanique
type: Concept
modified: 2016-04-18T16:47:07+02:00
in scheme: Lexique de l'escalier et des autres organes de circulation : emplacement, forme et structure - Inventaire/MH
preferred label: escalator @en
created: 2013-05-21T17:19:09+02:00
definition: Escalier dont les marches mobiles sont entraînées mécaniquement, tout en restant en permanence dans un plan horizontal, permettant de passer sans effort d'un niveau à un autre, dans ou à l'extérieur d'un bâtiment.
status: 1

escalator
type: PreferredTerm
modified: 2016-04-18T16:47:07+02:00
created: 2016-04-18T16:47:07+02:00
status: 1

escalier mécanique
type: PreferredTerm
modified: 2016-04-18T16:47:07+02:00
created: 2013-05-21T17:19:09+02:00
status: 1

degré
type: Concept
modified: 2016-05-31T11:53:19+02:00
in scheme: Lexique de l'escalier et des autres organes de circulation : emplacement, forme et structure - Inventaire/MH
created: 2016-05-31T11:44:03+02:00
definition: Escalier au développement limité ou courte volée, rachetant la hauteur d'une terrasse, d'un soubassement, etc. Il est généralement réduit à quelques marches.
status: 1

degré
type: PreferredTerm
modified: 2016-05-31T11:53:19+02:00
created: 2016-05-31T11:44:03+02:00
status: 1

escalier à double révolution
type: Concept
modified: 2016-04-18T12:47:10+02:00
in scheme: Lexique de l'escalier et des autres organes de circulation : emplacement, forme et structure - Inventaire/MH
preferred label: double spiral stairs @en
broader: escalier de type complexe
created: 2013-05-21T17:19:09+02:00
definition: Escalier double et tournant, dans lequel les révolutions d'une montée s’inscrivent entre les révolutions de l'autre montée.
status: 1

escalier de type complexe
type: PreferredTerm
modified: 2016-05-31T12:22:37+02:00
created: 2013-05-21T17:19:09+02:00
status: 1

escalier tournant
type: Concept
modified: 2016-05-31T12:25:03+02:00
in scheme: Lexique de l'escalier et des autres organes de circulation : emplacement, forme et structure - Inventaire/MH
narrower: escalier tournant à retours
narrower: escalier en vis
broader: escalier
created: 2013-05-21T17:19:09+02:00
definition: Escalier faisant au moins un révolution ou un retour complet.
status: 1

cage ouverte
type: Concept
modified: 2016-05-31T14:25:53+02:00
in scheme: Lexique de l'escalier et des autres organes de circulation : emplacement, forme et structure - Inventaire/MH
broader: escalier
created: 2013-05-21T17:19:09+02:00
status: 1

escalier en équerre
type: Concept
modified: 2016-05-31T12:24:39+02:00
in scheme: Lexique de l'escalier et des autres organes de circulation : emplacement, forme et structure - Inventaire/MH
broader: escalier
created: 2013-05-21T17:19:09+02:00
definition: Escalier à un seul retour à 90°. Il est constitué par une seule volée à quartier-tournant ou par deux volées tournant sur un repos.
status: 1

escalier sur voûte
type: Concept
modified: 2016-05-31T14:24:36+02:00
in scheme: Lexique de l'escalier et des autres organes de circulation : emplacement, forme et structure - Inventaire/MH
broader: escalier
created: 2013-05-21T17:19:09+02:00
hidden label: sur voûte
definition: Escalier dont les volées suspendues sont portées par des voûtes.
status: 1

escalier
type: PreferredTerm
modified: 2016-04-18T10:26:39+02:00
created: 2013-05-21T17:19:09+02:00
status: 1

escalier suspendu
type: Concept
modified: 2016-05-31T14:23:28+02:00
in scheme: Lexique de l'escalier et des autres organes de circulation : emplacement, forme et structure - Inventaire/MH
preferred label: flying stairs @en
broader: escalier
created: 2013-05-21T17:19:09+02:00
hidden label: suspendu
definition: Escalier dont les volées sont en surplomb : elles n'ont d'appui qu'un seul côté.
status: 1

stairs
type: PreferredTerm
modified: 2016-04-18T10:26:39+02:00
created: 2016-04-18T10:26:39+02:00
status: 1

escalier droit
type: Concept
modified: 2016-05-31T12:22:59+02:00
in scheme: Lexique de l'escalier et des autres organes de circulation : emplacement, forme et structure - Inventaire/MH
preferred label: straight stairs @en
broader: escalier
created: 2013-05-21T17:19:09+02:00
definition: Escalier formé d'une ou plusieurs volées se développant sur un même axe et dans le même sens.
status: 1

échelle
type: Concept
modified: 2016-05-31T12:20:23+02:00
in scheme: Lexique de l'escalier et des autres organes de circulation : emplacement, forme et structure - Inventaire/MH
preferred label: ladder @en
broader: escalier
created: 2013-05-21T17:19:09+02:00
definition: Escalier droit à limons ou crémaillère centrale portant des marches sans contremarche.
status: 1

escalier en maçonnerie
type: Concept
modified: 2016-05-31T14:25:00+02:00
in scheme: Lexique de l'escalier et des autres organes de circulation : emplacement, forme et structure - Inventaire/MH
broader: escalier
created: 2013-05-21T17:19:09+02:00
hidden label: en maçonnerie
status: 1

escalier en équerre
type: PreferredTerm
modified: 2016-05-31T12:24:39+02:00
created: 2013-05-21T17:19:09+02:00
status: 1

escalier en vis avec jour
type: Concept
modified: 2016-04-18T16:04:56+02:00
in scheme: Lexique de l'escalier et des autres organes de circulation : emplacement, forme et structure - Inventaire/MH
broader: escalier en vis
created: 2013-05-21T17:19:09+02:00
definition: Escalier en vis se développant autour d'un jour central.
status: 1
broad match: cb16768593k

escalier en vis avec jour
type: PreferredTerm
modified: 2016-04-18T16:04:56+02:00
created: 2013-05-21T17:19:09+02:00
status: 1

escalier en vis
type: Concept
modified: 2016-04-18T14:50:25+02:00
in scheme: Lexique de l'escalier et des autres organes de circulation : emplacement, forme et structure - Inventaire/MH
preferred label: spiral stairs @en
narrower: escalier en vis avec jour
narrower: escalier en vis sans jour
broader: escalier tournant
created: 2013-05-21T17:19:09+02:00
definition: Escalier tournant formé uniquement de marches gironnées. Les volées sont formées de marches portant noyau, de marches reposant sur des faux-limons en crémaillère, ou sur une voûte en berceau hélicoïdal.
status: 1

spiral stairs
type: PreferredTerm
modified: 2016-04-18T14:50:25+02:00
created: 2016-04-18T14:50:25+02:00
status: 1

escalier en vis
type: PreferredTerm
modified: 2016-04-18T14:50:25+02:00
created: 2013-05-21T17:19:09+02:00
status: 1

escalier en vis sans jour
type: Concept
modified: 2016-04-18T15:26:20+02:00
in scheme: Lexique de l'escalier et des autres organes de circulation : emplacement, forme et structure - Inventaire/MH
preferred label: solid newel stairs @en
broader: escalier en vis
created: 2013-05-21T17:19:09+02:00
definition: Escalier en vis à noyau.
status: 1
broad match: cb16768593k

escalier tournant à retours sans jour
type: Concept
modified: 2016-04-18T15:48:49+02:00
in scheme: Lexique de l'escalier et des autres organes de circulation : emplacement, forme et structure - Inventaire/MH
broader: escalier tournant à retours
created: 2013-05-21T17:19:09+02:00
definition: Escalier présentant plus d'un retour, sans jour central.
status: 1

escalier tournant à retours
type: PreferredTerm
modified: 2016-04-18T15:31:31+02:00
created: 2013-05-21T17:19:09+02:00
status: 1

en charpente métallique
type: SimpleNonPreferredTerm
modified: 2016-05-31T11:30:23+02:00
created: 2013-05-21T17:19:09+02:00
status: 1

escalier en charpente métallique
type: PreferredTerm
modified: 2016-05-31T11:30:23+02:00
created: 2016-05-30T17:18:07+02:00
status: 1

escalier suspendu
type: PreferredTerm
modified: 2016-05-31T14:23:28+02:00
created: 2016-05-30T17:24:00+02:00
status: 1

flying stairs
type: PreferredTerm
modified: 2016-05-31T14:23:28+02:00
created: 2016-04-18T16:26:40+02:00
status: 1

suspendu
type: SimpleNonPreferredTerm
modified: 2016-05-31T14:23:28+02:00
created: 2013-05-21T17:19:09+02:00
status: 1

échelle
type: PreferredTerm
modified: 2016-05-31T12:20:23+02:00
created: 2013-05-21T17:19:09+02:00
status: 1

ladder
type: PreferredTerm
modified: 2016-05-31T12:20:23+02:00
created: 2016-04-18T11:55:31+02:00
status: 1

escalier dans-œuvre
type: SimpleNonPreferredTerm
modified: 2016-05-30T17:29:22+02:00
created: 2013-05-21T17:19:09+02:00
status: 1

escalier dans-oeuvre
type: PreferredTerm
modified: 2016-05-30T17:29:22+02:00
created: 2015-03-06T08:35:21+01:00
status: 1

rampe d'accès
type: Concept
modified: 2016-04-18T16:53:45+02:00
in scheme: Lexique de l'escalier et des autres organes de circulation : emplacement, forme et structure - Inventaire/MH
preferred label: ramp @en
created: 2013-05-21T17:19:09+02:00
definition: Ouvrage en pente permettant de passer d'un plan à un autre, pouvant être ouvert aux animaux et véhicules. Les rampes sont parfois coupées par des pas-d'âne (marches rampantes très basses et espacées).
status: 1

ramp
type: PreferredTerm
modified: 2016-04-18T16:53:45+02:00
created: 2016-04-18T16:53:45+02:00
status: 1

rampe d'accès
type: PreferredTerm
modified: 2016-04-18T16:53:45+02:00
created: 2013-05-21T17:19:09+02:00
status: 1

escalier à double révolution
type: PreferredTerm
modified: 2016-04-18T12:47:10+02:00
created: 2013-05-21T17:19:09+02:00
status: 1

double spiral stairs
type: PreferredTerm
modified: 2016-04-18T12:47:10+02:00
created: 2016-04-18T12:39:06+02:00
status: 1

escalier de distribution extérieur
type: PreferredTerm
modified: 2016-04-18T10:49:30+02:00
created: 2013-05-21T17:19:09+02:00
status: 1

escalier hors-oeuvre
type: PreferredTerm
modified: 2016-05-30T17:30:58+02:00
created: 2015-03-06T08:38:11+01:00
status: 1

escalier hors-œuvre
type: SimpleNonPreferredTerm
modified: 2016-05-30T17:30:58+02:00
created: 2013-05-21T17:19:09+02:00
status: 1

cage ouverte
type: PreferredTerm
modified: 2016-05-31T14:25:53+02:00
created: 2013-05-21T17:19:09+02:00
status: 1

escalier en fer-à-cheval
type: PreferredTerm
modified: 2016-04-18T13:05:26+02:00
created: 2013-05-21T17:19:09+02:00
status: 1

horseshoe stairs
type: PreferredTerm
modified: 2016-04-18T13:05:26+02:00
created: 2016-04-18T13:05:26+02:00
status: 1

freight elevator
type: PreferredTerm
modified: 2016-04-18T16:41:09+02:00
created: 2016-04-18T16:41:09+02:00
status: 1

monte-charge
type: PreferredTerm
modified: 2016-04-18T16:41:09+02:00
created: 2013-05-21T17:19:09+02:00
status: 1

escalier tournant à retours sans jour
type: PreferredTerm
modified: 2016-04-18T15:48:49+02:00
created: 2013-05-21T17:19:09+02:00
status: 1

straight stairs
type: PreferredTerm
modified: 2016-05-31T12:22:59+02:00
created: 2016-04-18T13:10:43+02:00
status: 1

escalier droit
type: PreferredTerm
modified: 2016-05-31T12:22:59+02:00
created: 2013-05-21T17:19:09+02:00
status: 1

escalier en vis sans jour
type: PreferredTerm
modified: 2016-04-18T15:26:20+02:00
created: 2013-05-21T17:19:09+02:00
status: 1

solid newel stairs
type: PreferredTerm
modified: 2016-04-18T15:26:20+02:00
created: 2016-04-18T15:23:19+02:00
status: 1

escalier tournant
type: PreferredTerm
modified: 2016-05-31T12:25:03+02:00
created: 2013-05-21T17:19:09+02:00
status: 1

emmarchement
type: Concept
modified: 2016-05-31T12:08:36+02:00
in scheme: Lexique de l'escalier et des autres organes de circulation : emplacement, forme et structure - Inventaire/MH
created: 2016-05-31T11:54:16+02:00
definition: Escalier formé de quelques marches très longues ou étendues sur le périmètre complet d'un soubassement, d'une terrasse, etc.
status: 1

emmarchement
type: PreferredTerm
modified: 2016-05-31T12:08:36+02:00
created: 2016-05-31T11:54:16+02:00
status: 1

escalier sur voûte
type: PreferredTerm
modified: 2016-05-31T14:24:36+02:00
created: 2016-05-30T17:20:23+02:00
status: 1

sur voûte
type: SimpleNonPreferredTerm
modified: 2016-05-31T14:24:36+02:00
created: 2013-05-21T17:19:09+02:00
status: 1

en maçonnerie
type: SimpleNonPreferredTerm
modified: 2016-05-31T14:25:00+02:00
created: 2013-05-21T17:19:09+02:00
status: 1

escalier en maçonnerie
type: PreferredTerm
modified: 2016-05-31T14:25:00+02:00
created: 2016-05-30T17:19:44+02:00
status: 1

forme de l'escalier
type: Collection
modified: 2016-05-31T14:35:40+02:00
in scheme: Lexique de l'escalier et des autres organes de circulation : emplacement, forme et structure - Inventaire/MH
created: 2016-05-31T12:19:17+02:00
member: escalier de type complexe
member: escalier tournant
member: escalier en équerre
member: escalier droit
member: échelle

structure de l'escalier
type: Collection
modified: 2016-05-31T14:27:11+02:00
in scheme: Lexique de l'escalier et des autres organes de circulation : emplacement, forme et structure - Inventaire/MH
created: 2016-05-31T14:26:45+02:00
member: escalier en charpente
member: cage ouverte
member: escalier sur voûte
member: escalier suspendu
member: escalier en maçonnerie

emplacement de l'escalier
type: Collection
modified: 2016-05-31T12:14:56+02:00
in scheme: Lexique de l'escalier et des autres organes de circulation : emplacement, forme et structure - Inventaire/MH
created: 2016-05-31T12:09:31+02:00
member: escalier de distribution
member: escalier isolé