document audiovisuel
created: 2013-07-05T10:06:35+0200
modified: 2012-11-22T00:00:00+0100
status: 1
type: Concept
alternative label: cassette audio
alternative label: cassette vidéo
alternative label: cd-audio
alternative label: cédérom
alternative label: dvd
alternative label: film
in scheme: T3
scope note: Ce champ recouvre tout document sonore ou visuel, quel que soit son support. La liste des EP est non limitative.