inca
created: 2013-07-05T11:27:24+02:00
modified: 2013-07-05T00:00:00+02:00
status: 1
type: Concept
broader: T51-90
definition: Nom des souverains successifs qui, avant la conquête espagnole, régnèrent sur le Pérou et les régions limitrophes. Par extension Les Incas, dans cet empire, les membres de l'aristocratie. (Acad. fr)
in scheme: T51