mérovingien
created: 2013-07-05T11:27:24+02:00
modified: 2013-07-05T00:00:00+02:00
status: 1
type: Concept
broader: T51-90
definition: Dynastie qui régna sur les Francs Saliens, puis sur la Gaule à partir de Clovis (481-511) ; elle fut évincée par les Carolingiens en 751. (Larousse)
in scheme: T51