miniature
created: 2013-07-05T11:27:24+02:00
modified: 2013-07-05T00:00:00+02:00
status: 1
type: Concept
broader: T51-1
definition: Genre de peinture délicate de petites dimensions.(Robert)
in scheme: T51
scope note: Redoubler, si nécessaire, avec émaillerie. A ne pas confondre avec enluminure.