cartes - plans
created: 2013-07-05T11:27:24+02:00
modified: 2013-07-05T00:00:00+02:00
status: 1
type: Concept
broader: T51-127
definition: Carte : Surface plane sur laquelle est représentée la figure de la Terre, du ciel ; par méton., cette représentation. Ce qui représente le globe terrestre ou une de ses parties. (Acad.fr) ; Plan : représentation d'une construction (ou d'un ensemble de constructions, d'un terrain, d'un jardin, etc) en projection horizontale. (Robert)
in scheme: T51